�S���n�������c�̃R�[�h,ID,�n�������c�̖�,����,����_�J�i,����_�p��,���ݒn_�S���n�������c�̃R�[�h,���ݒn_�A���\�L,���ݒn_�s���{��,���ݒn_�s�撬��,���ݒn_����,���ݒn_�Ԓn�ȉ�,��������(����),�ܓx,�o�x,���x�̎��,���x�̒l,�ݒu�ʒu,�d�b�ԍ�,�����ԍ�,�A���惁�[���A�h���X,�A����FormURL,�A������l�i���̑��ASNS�Ȃǁj,�X�֔ԍ�,�@�l�ԍ�,�c�̖�,���p�\�j��,�J�n����,�I������,���p�\�������L����,�����Ή��ݔ��̗L��,URL,�摜1,�摜1_���C�Z���X,�摜2,�摜2_���C�Z���X,�O�����p�s��,���l
173843,FF000000001,�ΐ쌧�u�꒬,�u�꒬����,�V�J�}�`���N�o,shikamachiyakuba,173843,�ΐ쌧�H��S�u�꒬���g���1-1,�ΐ쌧,�u�꒬,���g���,1��1��,,37.0063721,136.7780014,�K��,1,1�K�Z���ۑ����O,(0767)32-1111,,,,,925-0198,7.00002E+12,�u�꒬,���ΐ��؋��y���j,,,24���ԗ��p��,,,,,,,,
173843,FF000000002,�ΐ쌧�u�꒬,�u�꒬����x���x��,�V�J�}�`���N�o�g�M�V�V��,shikamachiyakubatogishisho,173843,�ΐ쌧�H��S�u�꒬�x���̉ƒ��b-10,�ΐ쌧,�u�꒬,�x���̉ƒ�,�b��10�Ԓn,�u�꒬����x���x���P�K,37.14458914,136.7255505,�K��,1,1�K���������O,(0767)42-1111,,,,,925-0498,7.00002E+12,�u�꒬,���ΐ��؋��y���j,8:30,22:00,,,,,,,,,
173843,FF000000003,�ΐ쌧�u�꒬,�u�꒬�ی������Z���^�[,�V�J�}�`�z�P���t�N�V�Z���^�[,shikamachihokenfukushisenta,173843,�ΐ쌧�H��S�u�꒬���l���J-1-1,�ΐ쌧,�u�꒬,���l��,�J�̂P�Ԓn�P,,37.0109661,136.775515,�K��,1,���������L��,(0767)32-0339,,,,,925-0141,7.00002E+12,�u�꒬,���ΐ��؋�,8:30,17:15,�y�A���A�j���͗��p�s�B12/29����1/3�܂ł͗��p�s�B,,,,,,,,
173843,FF000000004,�ΐ쌧�u�꒬,�u��N���j�b�N,�V�J�N���j�b�N,shikakurinikku,173843,�ΐ쌧�H��S�u�꒬���l����-79-1,�ΐ쌧,�u�꒬,���l��,����79�Ԓn�P,,37.00304277,136.7792873,�K��,1,�f�@��,(0767)32-5307,,,,,925-0141,7.00002E+12,�u�꒬,���ΐ��؋��y,8:30,17:00,�y�͌ߑO���̂ݗ��p�B���A�j���͗��p�s�B12/29�`1/3�܂ł͗��p�s��,,,,,,,,
173843,FF000000005,�ΐ쌧�u�꒬,�u�꒬�V���o�[�n�E�X,�V�J�}�`�V���o�[�n�E�X,shikamachishirubahausu,173843,�ΐ쌧�H��S�u�꒬��c9-1-1,�ΐ쌧,�u�꒬,��c,9��1�Ԓn1,,37.05296385,136.8144659,�K��,1,���r�[,(0767)37-2750,,,,,925-0202,7.00002E+12,�u�꒬,�ΐ��؋��y��,8:30,17:00,���͗��p�s�B12/28����1/4�܂ł͗��p�s�B,,,,,,,,
173843,FF000000006,�ΐ쌧�u�꒬,�u�꒬�n��x�{�{�݂₷�炬��,�V�J�}�`�`�C�L�L���E���E�V�Z�c���X���M�\�E,shikamachichiikikyuyoshisetsuyasuragiso,173843,�ΐ쌧�H��S�u�꒬����12-24,�ΐ쌧,�u�꒬,����,12��24��,,36.98671623,136.8005338,�K��,1,���r�[,(0767)36-1846,,,,,925-0137,7.00002E+12,�u�꒬,�ΐ��؋��y��,8:30,17:00,���͗��p�s�B12/28����1/4�܂ł͗��p�s�B,,,,,,,,
173843,FF000000007,�ΐ쌧�u�꒬,�u�꒬�Ƃ��n�敟���Z���^�[,�V�J�}�`�g�M�`�C�L�t�N�V�Z���^�[,shikamachitogichiikifukushisenta,173843,�ΐ쌧�H��S�u�꒬�����͌�50,�ΐ쌧,�u�꒬,�����͌�,50,,37.1531552,136.7017554,�K��,1,���������L��,(0767)42-2020,,,,,925-0564,7.00002E+12,�u�꒬,���Ζ؋��y��,9:30,20:30,���͗��p�s�B12/29����1/3�܂ł͗��p�s�B,,,,,,,,
173843,FF000000008,�ΐ쌧�u�꒬,�u�꒬�Ƃ��n�敟���Z���^�[,�V�J�}�`�g�M�`�C�L�t�N�V�Z���^�[,shikamachitogichiikifukushisenta,173843,�ΐ쌧�H��S�u�꒬�����͌�50,�ΐ쌧,�u�꒬,�����͌�,50,,37.1531552,136.7017554,�K��,1,�������L��,(0767)42-2020,,,,,925-0564,7.00002E+12,�u�꒬,���Ζ؋��y��,9:30,20:30,���͗��p�s�B12/29����1/3�܂ł͗��p�s�B,,,,,,,,
173843,FF000000009,�ΐ쌧�u�꒬,�u�꒬�f�C�T�[�r�X�Z���^�[,�V�J�}�`�f�C�T�[�r�X�Z���^�[,shikamachideisabisusenta,173843,�ΐ쌧�H��S�u�꒬���l����-24-1,�ΐ쌧,�u�꒬,���l��,��-24-1,,37.0078003,136.7760306,�K��,1,�����O,(0767)32-6000,,,,,925-0141,7.00002E+12,�u�꒬,���ΐ��؋��y,9:00,16:05,���͗��p�s�B1/1�͗��p�s�B,,,,,,,,
173843,FF000000010,�ΐ쌧�u�꒬,�u�꒬������,�V�J�}�`�W�h�E�J��,shikamachijidokan,173843,�ΐ쌧�H��S�u�꒬���l���J-1-1,�ΐ쌧,�u�꒬,���l��,�J-1-1,,37.01070315,136.7772736,�K��,1,���փz�[��,(0767)32-1724,,,,,925-0141,7.00002E+12,�u�꒬,���Ζ؋��y��,9:00,17:30,�j���A��3���j���͗��p�s�B12/29����1/3�܂ł͗��p�s�B,,,,,,,,
173843,FF000000011,�ΐ쌧�u�꒬,�u����ی㎙���N���u,�V�J�z�E�J�S�W�h�E�N���u,shikahokagojidokurabu,173843,�ΐ쌧�H��S�u�꒬���l���}-14-1,�ΐ쌧,�u�꒬,���l��,�}-14-1,,36.99829058,136.7803985,�K��,1,����,(0767)32-0384,,,,,925-0141,7.00002E+12,�u�꒬,���ΐ��؋�,9:30,19:00,�y�A���A�j���͗��p�s�B8/13�`8/15�A12/29����1/3�܂ł͗��p�s�B��3�y�͗��p�B��3�y�A�ċx�݁A�~�x�݊��Ԓ���7:30�`19:00,,,,,,,,
173843,FF000000012,�ΐ쌧�u�꒬,���̉w�Ƃ��C�X��,�~�`�m�G�L�g�M�E�~�J�C�h�E,michinoekitogiumikaido,173843,�ΐ쌧�H��S�u�꒬�x���̉ƒ��^-2-11,�ΐ쌧,�u�꒬,�x���̉ƒ�,�^-2-11,,37.14027342,136.7256718,�K��,1,���X�z�[���E��,(0767)42-0975,,,,,925-0447,7.00002E+12,�u�꒬,���ΐ��؋��y���j,9:00,17:30,,,,,,,,,
173843,FF000000013,�ΐ쌧�u�꒬,�A�N�A�p�[�N�@�V�E�I��,�A�N�A�p�[�N�V�I��,akuapakushion,173843,�ΐ쌧�H��S�u�꒬���g�V�ی�22-1,�ΐ쌧,�u�꒬,���g�V��,��22-1,,37.00774564,136.7807809,�K��,1,1�K���C�����O,(0767)32-8555,,,,,925-0154,7.00002E+12,�u�꒬,���ΐ��؋��y���j,9:00,22:00,,,,,,,,,
173843,FF000000014,�ΐ쌧�u�꒬,�Ԃ̃~���[�W�A���@�t���[���B,�n�i�m�~���[�W�A���t���[���B,hananomyujiamufurorii,173843,�ΐ쌧�H��S�u�꒬�ԏZ14-54-1,�ΐ쌧,�u�꒬,�ԏZ,14-54-1,,37.05680298,136.7317133,�K��,1,��������,(0767)32-8787,,,,,925-0161,7.00002E+12,�u�꒬,�ΐ��؋��y���j,9:30,17:00,���A�~���i�ߘa���N�x��12/23�`3/19�j�͗��p�s��,,,,,,,,
173843,FF000000015,�ΐ쌧�u�꒬,�\�o���]�[�g�G���A����Y,�m�g���]�[�g�G���A�}�X�z�K�E��,notorizotoeriamasuhogaura,173843,�ΐ쌧�H��S�u�꒬���_�C-3-1,�ΐ쌧,�u�꒬,���_,�C-3-1,,37.15057971,136.7081172,�K��,1,�Ǘ���������,(0767)32-2125,,,,,925-0454,7.00002E+12,�u�꒬,�c�Ɗ��Ԓ�����,9:00,17:00,�c�Ɗ��Ԃ�4/28�`9/30,,,,,,,,
173843,FF000000016,�ΐ쌧�u�꒬,�\�o���j�H�ƒc�n�R�~���j�e�B�{��,�m�g�`���E�J�N�R�E�M���E�_���`�R�~���j�e�B�V�Z�c,notochukakukogyodanchikomyuniteishisetsu,173843,�ΐ쌧�H��S�u�꒬��t��47-13,�ΐ쌧,�u�꒬,��t��,47-13,,37.07202123,136.7569326,�K��,1,����,(0767)38-1661,,,,,925-0375,7.00002E+12,�u�꒬,���ΐ��؋��y,9:00,21:00,���͗��p�s�B12/29����1/3�܂ł͗��p�s�B,,,,,,,,
173843,FF000000017,�ΐ쌧�u�꒬,�u�꒬�����̈��,�V�J�}�`�\�E�S�E�^�C�C�N�J��,shikamachisogotaiikukan,173843,�ΐ쌧�H��S�u�꒬��1-1,�ΐ쌧,�u�꒬,��,1��1��,,37.02441572,136.7643941,�K��,1,��t��������,(0767)32-3777,,,,,925-0167,7.00002E+12,�u�꒬,�ΐ��؋��y��,9:00,22:00,���j���x�فi���j�����j���̏ꍇ�͒��߂̋x���łȂ������x���Ƃ���j12/27����1/4�܂ł͗��p�s�B,,,,,,,,
173843,FF000000018,�ΐ쌧�u�꒬,�x��B��G�C�m�Z���^�[,�g�M�r�[�A���h�W�[�J�C���E�Z���^�[,togibiandojikaiyosenta,173843,�ΐ쌧�H��S�u�꒬�x���̉ƒ��b-21-1,�ΐ쌧,�u�꒬,�x���̉ƒ�,�b-21-1,,37.14366008,136.7279495,�K��,1,��t��������,(0767)42-8088,,,,,925-0447,7.00002E+12,�u�꒬,�ΐ��؋��y��,10:00,19:00,�y��19�F00�܂ŁA���j��17�F30�܂ŁA���j���i���j�j���̏ꍇ�͂��̗����j��12��29���`1��3���͋x��,,,,,,,,
173843,FF000000019,�ΐ쌧�u�꒬,�u�꒬���}����,�V�J�`���E���c�g�V���J��,shikachoritsutoshokan,173843,�ΐ쌧�H��S�u�꒬���l���J-1-2,�ΐ쌧,�u�꒬,���l��,�J-1-2,,37.01065679,136.7758856,�K��,1,1�K�J�E���^�[,(0767)32-1740,,,,,925-0141,7.00002E+12,�u�꒬,�ΐ��؋��y���j,9:30,18:00,12/28����1/4�܂ł͗��p�s�B�x���͌ߑO9��30������ߌ�5���܂ŁA6���A7���y��8���ɂ����ẮA�ߑO9��30������ߌ�6��30���܂�,,,,,,,,
173843,FF000000020,�ΐ쌧�u�꒬,�u�꒬���u�ꏬ�w�Z,�V�J�`���E���c�V�J�V���E�K�b�R�E,shikachoritsushikashogakko,173843,�ΐ쌧�H��S�u�꒬���l���}-14-1,�ΐ쌧,�u�꒬,���l��,�}-14-1,,36.99823293,136.7793894,�K��,1,1�K���w�N����,(0767)32-0320,,,,,925-0141,7.00002E+12,�u�꒬,���ΐ��؋�,8:10,16:40,�y�A���A�j���͗��p�s�B12/29����1/3�܂ł͗��p�s�B,,,,,,,,
173843,FF000000021,�ΐ쌧�u�꒬,�u�꒬���u�ꏬ�w�Z,�V�J�`���E���c�V�J�V���E�K�b�R�E,shikachoritsushikashogakko,173843,�ΐ쌧�H��S�u�꒬���l���}-14-1,�ΐ쌧,�u�꒬,���l��,�}-14-1,,36.99823293,136.7793894,�K��,2,2�K�z�[��,(0767)32-0320,,,,,925-0141,7.00002E+12,�u�꒬,���ΐ��؋�,8:10,16:40,�y�A���A�j���͗��p�s�B12/29����1/3�܂ł͗��p�s�B,,,,,,,,
173843,FF000000022,�ΐ쌧�u�꒬,�u�꒬���u�ꏬ�w�Z,�V�J�`���E���c�V�J�V���E�K�b�R�E,shikachoritsushikashogakko,173843,�ΐ쌧�H��S�u�꒬���l���}-14-1,�ΐ쌧,�u�꒬,���l��,�}-14-1,,36.99823293,136.7793894,�K��,3,3�K�z�[��,(0767)32-0320,,,,,925-0141,7.00002E+12,�u�꒬,���ΐ��؋�,8:10,16:40,�y�A���A�j���͗��p�s�B12/29����1/3�܂ł͗��p�s�B,,,,,,,,
173843,FF000000023,�ΐ쌧�u�꒬,�u�꒬���u�ꏬ�w�Z,�V�J�`���E���c�V�J�V���E�K�b�R�E,shikachoritsushikashogakko,173843,�ΐ쌧�H��S�u�꒬���l���}-14-1,�ΐ쌧,�u�꒬,���l��,�}-14-1,,36.99823293,136.7793894,�K��,1,1�K�̈��,(0767)32-0320,,,,,925-0141,7.00002E+12,�u�꒬,���ΐ��؋�,8:10,16:40,�y�A���A�j���͗��p�s�B12/29����1/3�܂ł͗��p�s�B,,,,,,,,
173843,FF000000024,�ΐ쌧�u�꒬,�u�꒬���x�����w�Z,�V�J�`���E���c�g�M�V���E�K�b�R�E,shikachoritsutogishogakko,173843,�ΐ쌧�H��S�u�꒬���_��-80,�ΐ쌧,�u�꒬,���_,��-80,,37.15973124,136.7441766,�K��,1,1�K�E������,(0767)42-0074,,,,,925-0454,7.00002E+12,�u�꒬,���ΐ��؋�,8:00,16:30,�y�A���A�j���͗��p�s�B12/29����1/3�܂ł͗��p�s�B,,,,,,,,
173843,FF000000025,�ΐ쌧�u�꒬,�u�꒬���u�ꒆ�w�Z,�V�J�`���E���c�V�J�`���E�K�b�R�E,shikachoritsushikachugakko,173843,�ΐ쌧�H��S�u�꒬���l���m-152,�ΐ쌧,�u�꒬,���l��,�m-152,,36.99955299,136.7736036,�K��,1,1�K���k����,(0767)32-1131,,,,,925-0141,7.00002E+12,�u�꒬,���ΐ��؋�,8:05,16:35,�y�A���A�j���͗��p�s�B12/29����1/3�܂ł͗��p�s�B,,,,,,,,
173843,FF000000026,�ΐ쌧�u�꒬,�u�꒬���u�ꒆ�w�Z,�V�J�`���E���c�V�J�`���E�K�b�R�E,shikachoritsushikachugakko,173843,�ΐ쌧�H��S�u�꒬���l���m-152,�ΐ쌧,�u�꒬,���l��,�m-152,,36.99955299,136.7736036,�K��,2,2�K�E�����O,(0767)32-1131,,,,,925-0141,7.00002E+12,�u�꒬,���ΐ��؋�,8:05,16:35,�y�A���A�j���͗��p�s�B12/29����1/3�܂ł͗��p�s�B,,,,,,,,
173843,FF000000027,�ΐ쌧�u�꒬,�u�꒬���x�����w�Z,�V�J�`���E���c�g�M�`���E�K�b�R�E,shikachoritsutogichugakko,173843,�ΐ쌧�H��S�u�꒬�x���̉ƒ��n-1-1,�ΐ쌧,�u�꒬,�x���̉ƒ�,�n-1-1,,37.1448268,136.7295956,�K��,1,1�K�E�����֑O�L��,(0767)42-0109,,,,,925-0447,7.00002E+12,�u�꒬,���ΐ��؋�,8:05,16:35,�y�A���A�j���͗��p�s�B12/29����1/3�܂ł͗��p�s�B,,,,,,,,
173843,FF000000028,�ΐ쌧�u�꒬,�u�꒬���x�����w�Z,�V�J�`���E���c�g�M�`���E�K�b�R�E,shikachoritsutogichugakko,173843,�ΐ쌧�H��S�u�꒬�x���̉ƒ��n-1-1,�ΐ쌧,�u�꒬,�x���̉ƒ�,�n-1-1,,37.1448268,136.7295956,�K��,1,�̈�ّ��ړI�g�C��,(0767)42-0109,,,,,925-0447,7.00002E+12,�u�꒬,���ΐ��؋�,8:05,16:35,�y�A���A�j���͗��p�s�B12/29����1/3�܂ł͗��p�s�B,,,,,,,,
173843,FF000000029,�ΐ쌧�u�꒬,�u�꒬���x���a�@,�V�J�`���E���c�g�M�r���E�C��,shikachoritsutogibyoin,173843,�ΐ쌧�H��S�u�꒬�x���n����7-110-1,�ΐ쌧,�u�꒬,�x���n����,7-110-1,,37.13784186,136.7314229,�K��,1,1�K�G���g�����X,(0767)42-1122,,,,,925-0446,7.00002E+12,�u�꒬,���ΐ��؋��y���j,,,24����365�����p��,,,,,,,,
173843,FF000000030,�ΐ쌧�u�꒬,�u�꒬����,�V�J�}�`���N�o,shikamachiyakuba,173843,�ΐ쌧�H��S�u�꒬���g���1-1,�ΐ쌧,�u�꒬,���g���,1��1��,,37.0063721,136.7780014,�K��,3,3�K���U�w�K�ۓ�,(0767)32-1111,,,,,925-0198,7.00002E+12,�u�꒬,���ΐ��؋��y���j,,,�C�x���g�����o���p�B�����͐��U�w�K�ۓ��ۊǁB,,,,,,,,
173843,FF000000031,�ΐ쌧�u�꒬,�u�꒬�����z�[��,�V�J�}�`�u���J�z�[��,shikamachibunkahoru,173843,�ΐ쌧�H��S�u�꒬���l���J-1-1,�ΐ쌧,�u�꒬,���l��,�J-1-1,,37.01081877,136.7758807,�K��,1,�P�K��������,(0767)32-2111,,,,,925-0141,7.00002E+12,�u�꒬,���ΐ��؋��y���j,9:00,22:00,12/28����1/3�܂ł͗��p�s�B,,,,,,,,
173843,FF000000032,�ΐ쌧�u�꒬,�������̑��\�o����,�C�R�C�m�����m�g�n���g�E,ikoinomuranotohanto,173843,�ΐ쌧�H��S�u�꒬���18-1,�ΐ쌧,�u�꒬,���,1��18��,,37.02466681,136.7625093,�K��,1,�t�����g,(0767)32-3131,,,,,925-0165,7.00002E+12,�u�꒬,���ΐ��؋��y���j,9:00,20:00,,,,,,,,,
173843,FF000000033,�ΐ쌧�u�꒬,�u�꒬���x�����w�Z,�V�J�`���E���c�g�M�V���E�K�b�R�E,shikachoritsutogishogakko,173843,�ΐ쌧�H��S�u�꒬���_��-80,�ΐ쌧,�u�꒬,���_,��-80,,37.15973124,136.7441766,�K��,1,1�K�̈�ٌ���,(0767)42-0074,,,,,925-0454,7.00002E+12,�u�꒬,���ΐ��؋�,8:00,16:30,�y�A���A�j���͗��p�s�B12/29����1/3�܂ł͗��p�s�B,,,,,,,,
173843,FF000000034,�ΐ쌧�u�꒬,�u�꒬�����l�ۈ牀,�V�J�`���E���c�^�J�n�}�z�C�N�G��,shikachoritsutakahamahoikuen,173843,�ΐ쌧�H��S�u�꒬���l���I117-2,�ΐ쌧,�u�꒬,���l��,�I117-2,,37.14598321,136.7290103,�K��,1,1�K����,(0767)32-0214,,,,,,,,,7:30,18:30,�y�A���A�j���͗��p�s�B12/29����1/4�܂ł͗��p�s�B,,,,,,,,
173843,FF000000035,�ΐ쌧�u�꒬,�u�꒬�����l�ۈ牀,�V�J�`���E���c�^�J�n�}�z�C�N�G��,shikachoritsutakahamahoikuen,173843,�ΐ쌧�H��S�u�꒬���l���I117-2,�ΐ쌧,�u�꒬,���l��,�I117-2,,37.14598321,136.7290103,�K��,2,2�K�z�[��,(0767)32-0214,,,,,,,,,7:30,18:30,�y�A���A�j���͗��p�s�B12/29����1/5�܂ł͗��p�s�B,,,,,,,,
173843,FF000000036,�ΐ쌧�u�꒬,�u�꒬���Ƃ��ۈ牀,�V�J�`���E���c�g�M�z�C�N�G��,shikachoritsutogihoikuen,173843,�ΐ쌧�H��S�u�꒬�x���̉ƒ��c1-26,�ΐ쌧,�u�꒬,�x���̉ƒ�,�c1-26,,37.145949,136.7290532,�K��,1,������,(0767)42-0366,,,,,,,,,7:30,18:30,�y�A���A�j���͗��p�s�B12/29����1/6�܂ł͗��p�s�B,,,,,,,,
173843,FF000000037,�ΐ쌧�u�꒬,�u�꒬���Ƃ��ۈ牀,�V�J�`���E���c�g�M�z�C�N�G��,shikachoritsutogihoikuen,173843,�ΐ쌧�H��S�u�꒬�x���̉ƒ��c1-26,�ΐ쌧,�u�꒬,�x���̉ƒ�,�c1-26,,37.145949,136.7290532,�K��,1,3�Ύ��ۈ玺,(0767)42-0366,,,,,,,,,7:30,18:30,�y�A���A�j���͗��p�s�B12/29����1/7�܂ł͗��p�s�B,,,,,,,,
